Target
Interleukin-17F
Ligand
BDBM617671
Substrate
Meas. Tech.
AlphaLISA Assay
IC50
31.6±n/a nM
Citation
 MARTIN, BPWESTERMANN, JKERN, OTHOLMES, AJMORRISON, AKICZUN, MAL MASRI, MSMITH, AHUXLEY, A IL-17A MODULATORS US Patent  US20230286943 Publication Date 9/14/2023 
Target
Name:
Interleukin-17F
Synonyms:
Cytokine ML-1 IL17F_HUMAN | il-17f
Type:
Enzyme Catalytic Domain
Mol. Mass.:
18053.35
Organism:
Homo sapiens (Human)
Description:
Q96PD4
Residue:
163
  
Inhibitor
Name:
BDBM617671
Synonyms:
US20230286943, Example 139
Type:
Small organic molecule
Emp. Form.:
C26H31N7O2
Mol. Mass.:
473.57
SMILES:
Cc1cnn(C)c1-c1ccc(NC(=O)C(NC(=O)c2ccnn2C)C2C3(CC3)CCC22CC2)nc1
: