Target
Glycogen synthase kinase-3 beta
Ligand
BDBM293569
Substrate
Meas. Tech.
GSK3β Kinase Assay
EC50
938±n/a nM
Citation
 KC, SKMak, CCEastman, BWCao, JBollu, VMittapalli, GKChiruta, C ISOQUINOLIN-3-YL CARBOXAMIDES AND PREPARATION AND USE THEREOF US Patent  US20230286945 Publication Date 9/14/2023 
Target
Name:
Glycogen synthase kinase-3 beta
Synonyms:
GSK-3 beta GSK3B Glycogen synthase kinase 3 beta (GSK3B) Glycogen synthase kinase-3 beta (GSK-3B) Glycogen synthase kinase-3 beta (GSK3B) Glycogen synthase kinase-3beta (GSK3B) | Serine/threonine-protein kinase GSK3B
Type:
Enzyme
Mol. Mass.:
46756.38
Organism:
Homo sapiens (Human)
Description:
P49841
Residue:
420
  
Inhibitor
Name:
BDBM293569
Synonyms:
US10106527, Compound 286 US11548872, Compound 286 US9951048, Compound 286
Type:
Small organic molecule
Emp. Form.:
C23H21N5O
Mol. Mass.:
383.4457
SMILES:
CN1Cc2ccc(cc2C1)C(=O)Nc1cc2cc(ccc2cn1)-c1cncn1C
: