Target
Potassium voltage-gated channel subfamily H member 2
Ligand
BDBM50201027
Substrate
Meas. Tech.
Inhibition of Specific Binding to the hERG-Receptor (HERGBD)
IC50
1010±n/a nM
Citation
 Schindler, RLankau, HHöfgen, NGrunwald, CEgerland, ULangen, BDost, RHage, TWard, S Pyrazoles US Patent  US10155727 Publication Date 12/18/2018 
Target
Name:
Potassium voltage-gated channel subfamily H member 2
Synonyms:
1,3-beta-glucan synthase component GLS2 ERG Eag-related protein 1 Ether-a-go-go-related gene (HERG) Ether-a-go-go-related gene potassium channel 1 Ether-a-go-go-related gene potassium channel 1 (hERG1) Ether-a-go-go-related protein 1 H-ERG KCNH2 Potassium voltage-gated channel subfamily H member 2 (hERG) Voltage-gated potassium channel subunit Kv11.1 hERG Potassium Channel 1 | putative potassium channel subunit
Type:
Multi-pass membrane protein
Mol. Mass.:
126672.65
Organism:
Homo sapiens (Human)
Description:
Q12809
Residue:
1159
  
Inhibitor
Name:
BDBM50201027
Synonyms:
CHEMBL3945735 USRE49517, Example 30
Type:
Small organic molecule
Emp. Form.:
C15H12ClF3N4
Mol. Mass.:
340.731
SMILES:
Cn1ccc(Cn2cc(cn2)-c2ccc(Cl)c(c2)C(F)(F)F)n1
: