Target
Renin
Ligand
BDBM212502
Substrate
Meas. Tech.
Inhibitory Activity Against Human Renin
IC50
7.00±n/a nM
Citation
 Iijima, TSugama, HKawaguchi, TShen, JXia, GXie, JHirai, M Nitrogen-containing saturated heterocyclic compound US Patent  US10155731 Publication Date 12/18/2018 
Target
Name:
Renin
Synonyms:
Angiotensinogenase RENI_HUMAN
Type:
Enzyme
Mol. Mass.:
45058.99
Organism:
Homo sapiens (Human)
Description:
Residue:
406
  
Inhibitor
Name:
BDBM212502
Synonyms:
US10155731, Example 60 | US9278944, 60
Type:
Small organic molecule
Emp. Form.:
C22H33N3O3
Mol. Mass.:
387.5157
SMILES:
COCCCN1CCc2ccc(cc12)[C@@H](C)N(C1CC1)C(=O)[C@H]1CNCCO1
: