Target
Non-receptor tyrosine-protein kinase TYK2
Ligand
BDBM277482
Substrate
Meas. Tech.
Biochemical JAK and Off-Target Kinase Assay
Ki
0.55±n/a nM
Citation
 Hudson, RKozak, JPodesto, DDHuang, XThalladi, VR Methods for treating Crohn's disease using 3-((1R,3s,5S)-3-((7-((5-methyl-1H-pyrazol-3-yl)amino)-1,6-naphthyridin-5-yl)amino)-8-azabicyclo[3.2.1]octan-8-yl)propanenitrile US Patent  US11780852 Publication Date 10/10/2023 
Target
Name:
Non-receptor tyrosine-protein kinase TYK2
Synonyms:
Non-receptor tyrosine-protein kinase TYK2 (TYK2) TYK2_HUMAN | Tyrosine-protein kinase TYK2
Type:
Protein
Mol. Mass.:
133666.03
Organism:
Homo sapiens (Human)
Description:
P29597
Residue:
1187
  
Inhibitor
Name:
BDBM277482
Synonyms:
US10072026, Example 2-18 | US11780852, Example 2-18
Type:
Small organic molecule
Emp. Form.:
C25H33N7OS
Mol. Mass.:
479.641
SMILES:
CCC(SC)C(=O)N1[C@H]2CCC[C@@H]1C[C@H](C2)Nc1nc(Nc2cc(C)[nH]n2)cc2ncccc12
: