Target
Protein kinase C beta type Isoform 2
Ligand
BDBM286253
Substrate
Meas. Tech.
Protein Kinase C beta 2 (PKCpII) Assay
Ki
18.9±n/a nM
Citation
 Li, HNukui, SScales, SATeng, MYin, C Substituted N-pyrimidin-4-yl-3-aminopyrrolo[3,4-C]pyrazoles as protein kinase C inhibitors US Patent  US11780853 Publication Date 10/10/2023 
Target
Name:
Isoform Beta-II of Protein kinase C beta type (PRKCB2)
Synonyms:
KPCB_HUMAN PRKCB Protein kinase C beta II type | Protein kinase C beta type (PRKCB2)
Type:
Enzyme
Mol. Mass.:
77017.33
Organism:
Homo sapiens (Human)
Description:
P05771-2
Residue:
673
  
Inhibitor
Name:
BDBM286253
Synonyms:
US11780853, Example AA2 | US9518060, Example AA2
Type:
Small organic molecule
Emp. Form.:
C21H31FN8O
Mol. Mass.:
430.5222
SMILES:
CCN1C[C@H](C)N(C[C@H]1C)C(=O)N1Cc2c(Nc3nc(C)ncc3F)n[nH]c2C1(C)C
: