Target
Replicase polyprotein 1ab
Ligand
BDBM74256
Substrate
Meas. Tech.
Chan-Lam
IC50
2300±n/a nM
Citation
Some error occurs, please report
Target
Name:
Replicase polyprotein 1ab
Synonyms:
ORF1ab polyprotein pp1ab | rep
Type:
Protein
Mol. Mass.:
794070.71
Organism:
2019-nCoV
Description:
P0DTD1
Residue:
7096
  
Inhibitor
Name:
BDBM74256
Synonyms:
EN300-17273 N-cyclohexylcyclohexanamine cid_7582 | dicyclohexylamine
Type:
Small organic molecule
Emp. Form.:
C12H23N
Mol. Mass.:
181.3177
SMILES:
C1CCC(CC1)NC1CCCCC1
: