Target
Lysosomal alpha-glucosidase
Ligand
BDBM18355
Substrate
Meas. Tech.
Inhibition of rhGAA Determined by Fluopol-ABPP
Ki
3100±n/a nM
Citation
 PY, SKANAZAWA, AVIEIRA DA CRUZ, ATANGARA, S NOVEL PHARMACOLOGICAL CHAPERONE COMPOUNDS OF HUMAN ACID ALPHA-GLUCOSIDASE AND THE THERAPEUTIC USE THEREOF US Patent  US20230339856 Publication Date 10/26/2023 
Target
Name:
Lysosomal alpha-glucosidase
Synonyms:
70 kDa lysosomal alpha-glucosidase Acid maltase Alpha glucosidase LYAG_HUMAN
Type:
PROTEIN
Mol. Mass.:
105312.45
Organism:
Homo sapiens (Human)
Description:
ChEMBL_1506060
Residue:
952
  
Inhibitor
Name:
BDBM18355
Synonyms:
(2R,3R,4R,5S)-1-butyl-2-(hydroxymethyl)piperidine-3,4,5-triol MIGLUSTAT US20230339856, Compound NB-DNJ | US9181184, 5
Type:
Small organic molecule
Emp. Form.:
C10H21NO4
Mol. Mass.:
219.278
SMILES:
CCCCN1C[C@H](O)[C@@H](O)[C@H](O)[C@H]1CO
: