Target
TGF-beta receptor type-1
Ligand
BDBM311401
Substrate
Meas. Tech.
Inhibition of ALK5 Kinase Phosphorylation
IC50
38.1±n/a nM
Citation
 Lee, JYRyu, KKim, JKim, YShin, DLee, BKang, SLee, HJung, HShin, YAPark, EAhn, JKim, HRyu, JH 2-pyridyl substituted imidazoles as ALK5 and/or ALK4 inhibitors US Patent  US10155763 Publication Date 12/18/2018 
Target
Name:
TGF-beta receptor type-1
Synonyms:
ALK-5 Activin A receptor type II-like protein kinase of 53kD SKR4 TGF-beta receptor type I TGFBR1 TGFR1_HUMAN Transforming growth factor-beta receptor type I
Type:
enzyme
Mol. Mass.:
55968.24
Organism:
Homo sapiens (Human)
Description:
P36897
Residue:
503
  
Inhibitor
Name:
BDBM311401
Synonyms:
US10155763, Example 15
Type:
Small organic molecule
Emp. Form.:
C23H25N7O
Mol. Mass.:
415.4909
SMILES:
CN(C)CCOc1cnc2ccc(cc2n1)-c1c(nc2NCCn12)-c1cccc(C)n1
: