Target
Serine/threonine-protein kinase B-raf
Ligand
BDBM635361
Substrate
Meas. Tech.
Enzymatic BRAF Kinase Activity Assay
IC50
5.5±n/a nM
Citation
 Kanouni, TCox, JMTyhonas, JKania, RSChakravorty, SJChen, YK Inhibtors of Raf kinases US Patent  US11814384 Publication Date 11/14/2023 
Target
Name:
Serine/threonine-protein kinase B-raf
Synonyms:
B-RAF B-Raf proto-oncogene serine/threonine-protein kinase BRAF1 RAFB1 v-Raf murine sarcoma viral oncogene homolog B1
Type:
Serine/threonine-protein kinase
Mol. Mass.:
84446.00
Organism:
Homo sapiens (Human)
Description:
P15056
Residue:
766
  
Inhibitor
Name:
BDBM635361
Synonyms:
(3S)-N-[2-Fluoro-4-methyl-5-[2-methyl-7- (morpholin-4-yl)indazol-5-yl]phenyl]-3-(2,2,2- trifluoroethyl)pyrrolidine-1-carboxamide | US11814384, Example 1
Type:
Small organic molecule
Emp. Form.:
C26H29F4N5O2
Mol. Mass.:
519.5344
SMILES:
Cc1cc(F)c(NC(=O)N2CC[C@@H](CC(F)(F)F)C2)cc1-c1cc(N2CCOCC2)c2nn(C)cc2c1
: