Target
Serine/threonine-protein kinase B-raf
Ligand
BDBM635465
Substrate
Meas. Tech.
Enzymatic BRAF Kinase Activity Assay
IC50
5.5±n/a nM
Citation
 Kanouni, TCox, JMTyhonas, JKania, RSChakravorty, SJChen, YK Inhibtors of Raf kinases US Patent  US11814384 Publication Date 11/14/2023 
Target
Name:
Serine/threonine-protein kinase B-raf
Synonyms:
B-RAF B-Raf proto-oncogene serine/threonine-protein kinase BRAF1 RAFB1 v-Raf murine sarcoma viral oncogene homolog B1
Type:
Serine/threonine-protein kinase
Mol. Mass.:
84446.00
Organism:
Homo sapiens (Human)
Description:
P15056
Residue:
766
  
Inhibitor
Name:
BDBM635465
Synonyms:
2-Fluoro-N-[3-fluoro-1-(1-methylcyclopropyl)pyrazol-4-yl]-4-methyl-5-[2-methyl-8-(morpholin-4-yl)-[1,2,4]triazolo[1,5-a]pyridin-6-yl]benzamide | US11814384, Example 310
Type:
Small organic molecule
Emp. Form.:
C26H27F2N7O2
Mol. Mass.:
507.5351
SMILES:
Cc1nc2c(cc(cn2n1)-c1cc(C(=O)Nc2cn(nc2F)C2(C)CC2)c(F)cc1C)N1CCOCC1
: