Target
Coagulation factor X
Ligand
BDBM50443853
Substrate
Meas. Tech.
Enzymatic Activity Assay
IC50
0.430±n/a nM
Citation
Target
Name:
Coagulation factor X
Synonyms:
Activated coagulation factor X (FXa) Coagulation factor X precursor F10 Factor X heavy chain Factor Xa Stuart-Prower factor
Type:
Enzyme
Mol. Mass.:
54726.60
Organism:
Homo sapiens (Human)
Description:
Residue:
488
  
Inhibitor
Name:
BDBM50443853
Synonyms:
CHEMBL3091519 | US20230391761, Reference 1
Type:
Small organic molecule
Emp. Form.:
C24H30ClN5O5S2
Mol. Mass.:
568.109
SMILES:
CN1CCN(CC1)C(=O)[C@H](CNC(=O)c1ccc(Cl)s1)NS(=O)(=O)c1cccc(N2CCCC2=O)c1C
: