Target
Coagulation factor X
Ligand
BDBM639349
Substrate
Meas. Tech.
Enzymatic Activity Assay
IC50
0.490±n/a nM
Citation
Target
Name:
Coagulation factor X
Synonyms:
Activated coagulation factor X (FXa) Coagulation factor X precursor F10 Factor X heavy chain Factor Xa Stuart-Prower factor
Type:
Enzyme
Mol. Mass.:
54726.60
Organism:
Homo sapiens (Human)
Description:
Residue:
488
  
Inhibitor
Name:
BDBM639349
Synonyms:
2-(1-Methyl-1H-imidazol-2-yl)ethyl 3-[(5-chlorothiophene-2-carbonyl)amino]-N-{2-ethyl-3-[(3S)-3-hydroxy-2-oxopyrrolidin-1-yl]benzene-1-sulfonyl}-S-alaninate US20230391761, Example 2 US20230391761, Example 5 US20230391761, Example 7 US20230391761, Example 9
Type:
Small organic molecule
Emp. Form.:
C26H30ClN5O7S2
Mol. Mass.:
624.129
SMILES:
CCc1c(cccc1S(=O)(=O)N[C@@H](CNC(=O)c1ccc(Cl)s1)C(=O)OCCc1nccn1C)N1CC[C@H](O)C1=O
: