Target
Tryptophan 2,3-dioxygenase
Ligand
BDBM50289137
Substrate
Meas. Tech.
TDO Coupled Biochemical Assays
IC50
10000±n/a nM
Citation
 Hunter, BMcElroy, SWise, A Screening method US Patent  US10155972 Publication Date 12/18/2018 
Target
Name:
Tryptophan 2,3-dioxygenase
Synonyms:
T23O_HUMAN TDO2 TRPO Tryptophan oxygenase Tryptophanase
Type:
PROTEIN
Mol. Mass.:
47874.48
Organism:
Homo sapiens (Human)
Description:
ChEMBL_825691
Residue:
406
  
Inhibitor
Name:
BDBM50289137
Synonyms:
6-Fluoro-3-((E)-2-pyridin-3-yl-vinyl)-1H-indole US10155972, Compound 680C91
Type:
Small organic molecule
Emp. Form.:
C15H11FN2
Mol. Mass.:
238.2596
SMILES:
Fc1ccc2c(\C=C\c3cccnc3)c[nH]c2c1
: