Target
Tryptophan 2,3-dioxygenase
Ligand
BDBM311862
Substrate
Meas. Tech.
TDO Coupled Biochemical Assays
IC50
7943±n/a nM
Citation
 Hunter, BMcElroy, SWise, A Screening method US Patent  US10155972 Publication Date 12/18/2018 
Target
Name:
Tryptophan 2,3-dioxygenase
Synonyms:
T23O_HUMAN TDO2 TRPO Tryptophan oxygenase Tryptophanase
Type:
PROTEIN
Mol. Mass.:
47874.48
Organism:
Homo sapiens (Human)
Description:
ChEMBL_825691
Residue:
406
  
Inhibitor
Name:
BDBM311862
Synonyms:
US10155972, Compound LM10
Type:
Small organic molecule
Emp. Form.:
C11H8FN5
Mol. Mass.:
229.2131
SMILES:
Fc1ccc2c(\C=C\c3nnn[nH]3)c[nH]c2c1
: