Target
Tryptophan 2,3-dioxygenase
Ligand
BDBM50126144
Substrate
Meas. Tech.
TDO Coupled Biochemical Assays
IC50
501±n/a nM
Citation
 Hunter, BMcElroy, SWise, A Screening method US Patent  US10155972 Publication Date 12/18/2018 
Target
Name:
Tryptophan 2,3-dioxygenase
Synonyms:
T23O_HUMAN TDO2 TRPO Tryptophan oxygenase Tryptophanase
Type:
PROTEIN
Mol. Mass.:
47874.48
Organism:
Homo sapiens (Human)
Description:
ChEMBL_825691
Residue:
406
  
Inhibitor
Name:
BDBM50126144
Synonyms:
CHEMBL3629569 US10233190, Example 1304
Type:
Small organic molecule
Emp. Form.:
C18H22N2O
Mol. Mass.:
282.3801
SMILES:
OC(CC1c2ccccc2-c2cncn12)C1CCCCC1
: