Target
Tryptophan 2,3-dioxygenase
Ligand
BDBM311866
Substrate
Meas. Tech.
TDO Coupled Biochemical Assays
IC50
3981±0 nM
Citation
 Hunter, BMcElroy, SWise, A Screening method US Patent  US10155972 Publication Date 12/18/2018 
Target
Name:
Tryptophan 2,3-dioxygenase
Synonyms:
T23O_HUMAN TDO2 TRPO Tryptophan oxygenase Tryptophanase
Type:
PROTEIN
Mol. Mass.:
47874.48
Organism:
Homo sapiens (Human)
Description:
ChEMBL_825691
Residue:
406
  
Inhibitor
Name:
BDBM311866
Synonyms:
US10155972, IOmet compound B
Type:
Small organic molecule
Emp. Form.:
C14H16N2O2S
Mol. Mass.:
276.354
SMILES:
CS(=O)(=O)N1CCC(=CC1)c1c[nH]c2ccccc12
: