Target
Somatostatin receptor type 3
Ligand
BDBM311888
Substrate
Meas. Tech.
Radiogland Binding Assays
Ki
>8650±n/a nM
Citation
 Giovannini, RCui, YDoods, HFerrara, MJust, SKuelzer, RLingard, IMazzaferro, RRudolf, K Somatostatin receptor subtype 4 (SSTR4) agonists US Patent  US10166214 Publication Date 1/1/2019 
Target
Name:
Somatostatin receptor type 3
Synonyms:
SOMATOSTATIN SST3 SS3-R SSR-28 SSTR3 | Somatostatin receptor type 3 (SSTR3)
Type:
Protein
Mol. Mass.:
45855.97
Organism:
Homo sapiens (Human)
Description:
P32745
Residue:
418
  
Inhibitor
Name:
BDBM311888
Synonyms:
US10166214, Example 24 US9789082, Example 24
Type:
Small organic molecule
Emp. Form.:
C18H21N3O
Mol. Mass.:
295.3788
SMILES:
CC(C)(NC(=O)[C@@H]1[C@H]2CNC[C@@H]12)c1nccc2ccccc12
: