Target
Tyrosine-protein kinase BTK [14-552]
Ligand
BDBM324336
Substrate
Meas. Tech.
In Vitro BTK Kinase Assay
IC50
<1.000±n/a nM
Citation
 Hopkins, BTMa, BPrince, RMarx, ILyssikatos, JPZheng, FPeterson, MPatience, DB Inhibiting agents for bruton's tyrosine kinase US Patent  US11858926 Publication Date 1/2/2024 
Target
Name:
Tyrosine-protein kinase BTK [14-552]
Synonyms:
Tyrosine-protein kinase BTK (14-552)
Type:
Enzyme Catalytic Domain
Mol. Mass.:
62318.43
Organism:
Homo sapiens (Human)
Description:
Q06187[14-552]
Residue:
539
  
Inhibitor
Name:
BDBM324336
Synonyms:
(R)-5-(tert-butyl)-N-(2- (cyclopropylmethyl)-8- (2-((1-methyl-1H- pyrazol-4- yl)amino)pyrimidin-4- yl)-2,3,4,5-tetrahydro- 1H-benzo[c]azepin-5- yl)-1,3,4-oxadiazole-2- carboxamide US10227341, Compound 107 US11858926, Compound 107
Type:
Small organic molecule
Emp. Form.:
C29H35N9O2
Mol. Mass.:
541.6473
SMILES:
Cn1cc(Nc2nccc(n2)-c2ccc3[C@@H](CCN(CC4CC4)Cc3c2)NC(=O)c2nnc(o2)C(C)(C)C)cn1
: