Target
Baculoviral IAP repeat-containing protein 2/E3 ubiquitin-protein ligase XIAP
Ligand
BDBM312112
Substrate
Meas. Tech.
AlphaScreen Assay
IC50
170±n/a nM
Citation
 Kim, KSZhang, LWei, DD IAP antagonists US Patent  US9603889 Publication Date 3/28/2017 
Target
Name:
Baculoviral IAP repeat-containing protein 2/E3 ubiquitin-protein ligase XIAP
Synonyms:
XIAP BIR2-3 | XIAP-BIR2
Type:
Protein
Mol. Mass.:
Description:
Components:
This complex has 2 components.
Component 1
Name:
E3 ubiquitin-protein ligase XIAP
Synonyms:
API3 E3 ubiquitin-protein ligase XIAP Inhibitor of apoptosis protein 3 X-linked inhibitor of apoptosis XIAP | XIAP_HUMAN
Type:
Protein
Mol. Mass.:
56685.27
Organism:
Homo sapiens (Human)
Description:
P98170
Residue:
497
  
Component 2
Name:
Baculoviral IAP repeat-containing protein 2
Synonyms:
API1 BIRC2_HUMAN Cellular inhibitor of apoptosis 1 MIHB | RNF48
Type:
Protein
Mol. Mass.:
69900.47
Organism:
Homo sapiens (Human)
Description:
Q13490
Residue:
618
  
Inhibitor
Name:
BDBM312112
Synonyms:
(S)-2-((S)-3,3- Dimethyl-2-((S)-2- (methylamino) propanamido) butanoyl)-N-(4- (((3S,5S)-1-((S)- 3,3-dimethyl-2-((S)- 2-(methylamino) propanamido) butanoyl)-5-(((R)- 1,2,3,4-tetra- hydronaphthalen-1- yl)carbamoyl) pyrrolidin-3-yl) carbamoyl) benzyl)-N- ((R)-1-phenylethyl)- 1,2,3,4-tetra- hydroisoquinoline- 3-carboxamide | US9603889, Example 23
Type:
Small organic molecule
Emp. Form.:
C61H81N9O7
Mol. Mass.:
1052.3519
SMILES:
CN[C@@H](C)C(=O)N[C@H](C(=O)N1CC(C[C@H]1C(=O)NC1CCCc2ccccc12)NC(=O)c1ccc(CN(C(C)c2ccccc2)C(=O)[C@@H]2Cc3ccccc3CN2C(=O)[C@@H](NC(=O)[C@H](C)NC)C(C)(C)C)cc1)C(C)(C)C
: