Target
Baculoviral IAP repeat-containing protein 3/E3 ubiquitin-protein ligase XIAP
Ligand
BDBM312122
Substrate
Meas. Tech.
Fluorescence Polarization Assay (FPA)
IC50
120±n/a nM
Citation
 Kim, KSZhang, LWei, DD IAP antagonists US Patent  US9603889 Publication Date 3/28/2017 
Target
Name:
Baculoviral IAP repeat-containing protein 3/E3 ubiquitin-protein ligase XIAP
Synonyms:
XIAP BIR3 XIAP-BIR31
Type:
Protein
Mol. Mass.:
Description:
Components:
This complex has 2 components.
Component 1
Name:
E3 ubiquitin-protein ligase XIAP
Synonyms:
API3 E3 ubiquitin-protein ligase XIAP Inhibitor of apoptosis protein 3 X-linked inhibitor of apoptosis XIAP | XIAP_HUMAN
Type:
Protein
Mol. Mass.:
56685.27
Organism:
Homo sapiens (Human)
Description:
P98170
Residue:
497
  
Component 2
Name:
Baculoviral IAP repeat-containing protein 3
Synonyms:
API2 BIRC3_HUMAN Baculoviral IAP repeat-containing protein 3 (IAP1 BIR3) MIHC XIAP-BIR3 | cIAP1/cIAP2
Type:
Protein
Mol. Mass.:
68365.75
Organism:
Homo sapiens (Human)
Description:
Q13489
Residue:
604
  
Inhibitor
Name:
BDBM312122
Synonyms:
N1-(((S)-2-((S)- 3,3-Dimethyl- 2-((S)-2- (methylamino) propanamido) butanoyl)-1,2,3,4- tetrahydro- isoquinolin- 3-yl)methyl)- N4-((3S,5S)- 1-((S)-3,3- dimethyl-2-((S)-2- (methylamino) propanamido) butanoyl)- 5-(((R)-1,2,3,4- tetrahydro- naphthalen- 1-yl)carbamoyl) pyrrolidin-3-yl)-N1- (2-(naphthalen-1- yl)ethyl) terephthalamide | US9603889, Example 33
Type:
Small organic molecule
Emp. Form.:
C65H83N9O7
Mol. Mass.:
1102.4106
SMILES:
CN[C@@H](C)C(=O)N[C@H](C(=O)N1C[C@H](C[C@H]1C(=O)N[C@@H]1CCCc2ccccc12)NC(=O)c1ccc(cc1)C(=O)N(CCc1cccc2ccccc12)C[C@@H]1Cc2ccccc2CN1C(=O)[C@@H](NC(=O)[C@H](C)NC)C(C)(C)C)C(C)(C)C
: