Target
P2X purinoceptor 7
Ligand
BDBM173310
Substrate
Meas. Tech.
Ca2+ flux Assay
Ki
10.00±n/a nM
Citation
 Alcazar Vaca, MJAndres Gil, JILetavic, MARudolph, DAShireman, BTStenne, BMZiff, JM P2X7 modulators US Patent  US9604982 Publication Date 3/28/2017 
Target
Name:
P2X purinoceptor 7
Synonyms:
ATP receptor P2X purinoceptor 7 P2X purinoceptor 7 (P2X7) P2X7 rat P2rx7 | Purinergic receptor
Type:
Protein
Mol. Mass.:
68403.50
Organism:
Rattus norvegicus (Rat)
Description:
Q64663
Residue:
595
  
Inhibitor
Name:
BDBM173310
Synonyms:
US10323032, Example 43 US9604982, Example 43
Type:
Small organic molecule
Emp. Form.:
C18H12ClF3N4OS
Mol. Mass.:
424.827
SMILES:
FC(F)(F)c1cccc(C(=O)N2CCc3c(C2)ncnc3-c2cscn2)c1Cl
: