Target
P2X purinoceptor 7
Ligand
BDBM173396
Substrate
Meas. Tech.
Radioligand Binding Assay
Ki
12.6±n/a nM
Citation
 Alcazar Vaca, MJAndres Gil, JILetavic, MARudolph, DAShireman, BTStenne, BMZiff, JM P2X7 modulators US Patent  US9604982 Publication Date 3/28/2017 
Target
Name:
P2X purinoceptor 7
Synonyms:
ATP receptor P2RX7_HUMAN P2X purinoceptor 7 (P2X7) P2Z receptor | Purinergic receptor
Type:
Protein
Mol. Mass.:
68602.85
Organism:
Homo sapiens (Human)
Description:
Q99572
Residue:
595
  
Inhibitor
Name:
BDBM173396
Synonyms:
US10323032, Example 109 US9604982, Example 109
Type:
Small organic molecule
Emp. Form.:
C17H12ClF3N6O
Mol. Mass.:
408.765
SMILES:
FC(F)(F)c1cccc(C(=O)N2CCc3c(C2)ncnc3-n2cnnc2)c1Cl
: