Target
P2X purinoceptor 7
Ligand
BDBM173365
Substrate
Meas. Tech.
Radioligand Binding Assay
Ki
7.90±n/a nM
Citation
 Alcazar Vaca, MJAndres Gil, JILetavic, MARudolph, DAShireman, BTStenne, BMZiff, JM P2X7 modulators US Patent  US9604982 Publication Date 3/28/2017 
Target
Name:
P2X purinoceptor 7
Synonyms:
ATP receptor P2RX7_HUMAN P2X purinoceptor 7 (P2X7) P2Z receptor | Purinergic receptor
Type:
Protein
Mol. Mass.:
68602.85
Organism:
Homo sapiens (Human)
Description:
Q99572
Residue:
595
  
Inhibitor
Name:
BDBM173365
Synonyms:
US10323032, Example 78 US9604982, Example 78
Type:
Small organic molecule
Emp. Form.:
C21H20F3N5O
Mol. Mass.:
415.4116
SMILES:
C[C@@H]1Cc2c(CN1C(=O)c1cccc(c1C)C(F)(F)F)nc(C)nc2-c1ccn[nH]1
: