Target
P2X purinoceptor 7
Ligand
BDBM173368
Substrate
Meas. Tech.
Radioligand Binding Assay
Ki
7.90±n/a nM
Citation
 Alcazar Vaca, MJAndres Gil, JILetavic, MARudolph, DAShireman, BTStenne, BMZiff, JM P2X7 modulators US Patent  US9604982 Publication Date 3/28/2017 
Target
Name:
P2X purinoceptor 7
Synonyms:
ATP receptor P2RX7_HUMAN P2X purinoceptor 7 (P2X7) P2Z receptor | Purinergic receptor
Type:
Protein
Mol. Mass.:
68602.85
Organism:
Homo sapiens (Human)
Description:
Q99572
Residue:
595
  
Inhibitor
Name:
BDBM173368
Synonyms:
US10323032, Example 81 US9604982, Example 81
Type:
Small organic molecule
Emp. Form.:
C19H16Cl2FN5O
Mol. Mass.:
420.268
SMILES:
C[C@@H]1Cc2c(CN1C(=O)c1ccc(F)c(Cl)c1Cl)nc(C)nc2-c1ccn[nH]1
: