Target
P2X purinoceptor 7
Ligand
BDBM173415
Substrate
Meas. Tech.
Ca2+ flux Assay
Ki
3.00±n/a nM
Citation
 Alcazar Vaca, MJAndres Gil, JILetavic, MARudolph, DAShireman, BTStenne, BMZiff, JM P2X7 modulators US Patent  US9604982 Publication Date 3/28/2017 
Target
Name:
P2X purinoceptor 7
Synonyms:
ATP receptor P2X purinoceptor 7 P2X purinoceptor 7 (P2X7) P2X7 rat P2rx7 | Purinergic receptor
Type:
Protein
Mol. Mass.:
68403.50
Organism:
Rattus norvegicus (Rat)
Description:
Q64663
Residue:
595
  
Inhibitor
Name:
BDBM173415
Synonyms:
US10323032, Example 128 US9604982, Example 128
Type:
Small organic molecule
Emp. Form.:
C23H23ClF3N5O2
Mol. Mass.:
493.909
SMILES:
COCCn1ccc(n1)-c1nc(C)nc2CN([C@H](C)Cc12)C(=O)c1cccc(c1Cl)C(F)(F)F
: