Target
P2X purinoceptor 7
Ligand
BDBM312630
Substrate
Meas. Tech.
Radioligand Binding Assay
Ki
7.40±n/a nM
Citation
 Alcazar Vaca, MJAndres Gil, JILetavic, MARudolph, DAShireman, BTStenne, BMZiff, JM P2X7 modulators US Patent  US9604982 Publication Date 3/28/2017 
Target
Name:
P2X purinoceptor 7
Synonyms:
ATP receptor P2RX7_HUMAN P2X purinoceptor 7 (P2X7) P2Z receptor | Purinergic receptor
Type:
Protein
Mol. Mass.:
68602.85
Organism:
Homo sapiens (Human)
Description:
Q99572
Residue:
595
  
Inhibitor
Name:
BDBM312630
Synonyms:
(R*)-(2-chloro-3-fluorophenyl)(2,6-dimethyl-4-(1H-pyrazol-5-yl)-5,6-dihydropyrido[3,4-d]pyrimidin-7(8H)-yl)methanone | US9604982, Example 144
Type:
Small organic molecule
Emp. Form.:
C19H17ClFN5O
Mol. Mass.:
385.823
SMILES:
C[C@@H]1Cc2c(CN1C(=O)c1cccc(F)c1Cl)nc(C)nc2-c1ccn[nH]1
: