Target
ATP-sensitive inward rectifier potassium channel 1
Ligand
BDBM312616
Substrate
Meas. Tech.
Electrophysiology Assay
IC50
120±n/a nM
Citation
 Pasternak, ADeJesus, RKDing, FDong, SFrie, JLGu, XJiang, JShahripour, APio, BTang, HWalsh, S Inhibitors of the renal outer medullary potassium channel US Patent  US9604998 Publication Date 3/28/2017 
Target
Name:
ATP-sensitive inward rectifier potassium channel 1
Synonyms:
ATP-regulated potassium channel ROM-K ATP-sensitive inward rectifier potassium channel 1 KCNJ1 Potassium channel (ATP modulatory) ROMK1 The Renal Outer Medullary Potassium (ROMK)
Type:
Enzyme Catalytic Domain
Mol. Mass.:
44809.08
Organism:
Homo sapiens (Human)
Description:
gi_223460826
Residue:
391
  
Inhibitor
Name:
BDBM312616
Synonyms:
US9604998, Example 22 | US9604998, Example 23
Type:
Small organic molecule
Emp. Form.:
C24H26FN7O2
Mol. Mass.:
463.5073
SMILES:
Cc1c(ccc(F)c1[N+]#[C-])[C@@H]1CN2CCN(CC(O)c3cccc(c3)-n3cnnn3)C[C@@H]2CO1
: