Target
Nicotinamide phosphoribosyltransferase
Ligand
BDBM180086
Substrate
Meas. Tech.
Biochemical Inhibition Assay
pH
7.5±n/a
Temperature
298.15±n/a K
IC50
6.00±n/a nM
Comments
extracted
Citation
 Bair, KWBuckmelter, AJHan, BLin, JReynolds, DJSmith, CCWang, ZZheng, X Compounds and compositions for the inhibition of NAMPT US Patent  US9676721 Publication Date 6/13/2017 
Target
Name:
Nicotinamide phosphoribosyltransferase
Synonyms:
NAMPT NAmPRTase Nicotinamide phosphoribosyltransferase (NAMPT) PBEF1 | Pre-B-cell colony-enhancing factor 1
Type:
Enzyme
Mol. Mass.:
55524.98
Organism:
Homo sapiens (Human)
Description:
P43490
Residue:
491
  
Inhibitor
Name:
BDBM180086
Synonyms:
US9676721, 73 2-cyano-1-[(4-{[3-fluoro-5-(trifluoromethyl)benzene]sulfonyl}phenyl)methyl]-3-(pyridin-4-yl)guanidine
Type:
Small organic molecule
Emp. Form.:
C21H15F4N5O2S
Mol. Mass.:
477.435
SMILES:
Fc1cc(cc(c1)S(=O)(=O)c1ccc(CNC(Nc2ccncc2)=NC#N)cc1)C(F)(F)F
: