Target
Inhibitor of nuclear factor kappa-B kinase subunit beta
Ligand
BDBM312714
Substrate
Meas. Tech.
NIK Enzyme Inhibition Assay
Ki
2.92±n/a nM
Citation
 Blaquiere, NCastanedo, GFeng, JAHu, BStaben, SYuen, PWu, GBurch, J Alkynyl alcohols and methods of use US Patent  US9605005 Publication Date 3/28/2017 
Target
Name:
Inhibitor of nuclear factor kappa-B kinase subunit beta
Synonyms:
I-kappa-B Kinase 2 (IKK-beta) I-kappa-B-kinase beta IKBKB IKK-beta IKK2/IKK1 IKKB_HUMAN Inhibitor of nuclear factor kappa B kinase beta subunit Nuclear factor NF-kappa-B inhibitor kinase beta
Type:
Serine/threonine-protein kinase
Mol. Mass.:
86554.39
Organism:
Homo sapiens (Human)
Description:
GST-tagged IKK-2 was expressed in High Five cells and purified.
Residue:
756
  
Inhibitor
Name:
BDBM312714
Synonyms:
1-[4-[2-[(3R)-3-hydroxy-1- methyl-2-oxo-pyrrolidin-3- yl]ethynyl]-2-pyridyl]-6,6- dimethyl-5,7-dihydro-4H-inda- zole-3-carboxamide | US9605005, Example 4
Type:
Small organic molecule
Emp. Form.:
C22H25N5O3
Mol. Mass.:
407.4656
SMILES:
CN1CC[C@@](O)(C#Cc2ccnc(c2)-n2nc(C(N)=O)c3CCC(C)(C)Cc23)C1=O
: