Target
Baculoviral IAP repeat-containing protein 3/E3 ubiquitin-protein ligase XIAP
Ligand
BDBM312988
Substrate
Meas. Tech.
Homogeneous Time Resolved Fluorescence (HTRF) Assay
IC50
3.20±n/a nM
Citation
 Borzilleri, RMZhang, YMiller, MFraley, A Macrocyclic compounds for inhibition of inhibitors of apoptosis US Patent  US9605022 Publication Date 3/28/2017 
Target
Name:
Baculoviral IAP repeat-containing protein 3/E3 ubiquitin-protein ligase XIAP
Synonyms:
XIAP BIR3 XIAP-BIR31
Type:
Protein
Mol. Mass.:
Description:
Components:
This complex has 2 components.
Component 1
Name:
E3 ubiquitin-protein ligase XIAP
Synonyms:
API3 E3 ubiquitin-protein ligase XIAP Inhibitor of apoptosis protein 3 X-linked inhibitor of apoptosis XIAP | XIAP_HUMAN
Type:
Protein
Mol. Mass.:
56685.27
Organism:
Homo sapiens (Human)
Description:
P98170
Residue:
497
  
Component 2
Name:
Baculoviral IAP repeat-containing protein 3
Synonyms:
API2 BIRC3_HUMAN Baculoviral IAP repeat-containing protein 3 (IAP1 BIR3) MIHC XIAP-BIR3 | cIAP1/cIAP2
Type:
Protein
Mol. Mass.:
68365.75
Organism:
Homo sapiens (Human)
Description:
Q13489
Residue:
604
  
Inhibitor
Name:
BDBM312988
Synonyms:
US9605022, Example 17
Type:
Small organic molecule
Emp. Form.:
C81H96N18O13S
Mol. Mass.:
1561.807
SMILES:
CN[C@@H](C)C(=O)N[C@H](C(=O)N1CC[C@@H]2[C@H]1C(=O)N[C@@H](Cc1ccc3ccccc3c1)C(=O)N[C@H](Cc1ccc(OCc3cn(nn3)[C@@H]3CCN([C@@H]3C(=O)N[C@@H](Cc3ccc4ccccc4c3)C(=O)N[C@@H](Cc3ccc(OCc4cn2nn4)cc3)c2nc(=S)o[nH]2)C(=O)[C@@H](NC(=O)[C@H](C)NC)C(C)(C)C)cc1)C(O)=O)C(C)(C)C
: