Target
Lysosomal acid glucosylceramidase
Ligand
BDBM313316
Substrate
Meas. Tech.
High Throughput Screening (HTS) by Fluorescence Polarization (pH = 7.2)
IC50
20.0±2 nM
Citation
 Krainc, DSilverman, RBZheng, J Substituted quinazoline compounds and uses thereof for modulating glucocerebrosidase activity US Patent  US10167270 Publication Date 1/1/2019 
Target
Name:
Lysosomal acid glucosylceramidase
Synonyms:
Acid beta-glucosidase Beta-glucocerebrosidase D-glucosyl-N-acylsphingosine glucohydrolase GBA1 GC GLUC Glucosylceramidase (GBA) Glucosylceramidase precursor (Beta-glucocerebrosidase) (Acid beta-glucosidase) (D-glucosyl-N-acylsphingosine glucohydrolase) (Alglucerase) (Imiglucerase) beta-glucocerebrosidase (GCase)
Type:
Enzyme
Mol. Mass.:
59724.64
Organism:
Homo sapiens (Human)
Description:
The beta-Glu activity was measured with commercially available beta-glucocerebrosidase (Ceredase) as the enzyme source.
Residue:
536
  
Inhibitor
Name:
BDBM313316
Synonyms:
US10167270, Compound 6c
Type:
Small organic molecule
Emp. Form.:
C20H22N4
Mol. Mass.:
318.4155
SMILES:
C[C@H]1CCC(CC1)Nc1nc(nc2ccccc12)-c1cccnc1
: