Target
Tyrosine-protein kinase JAK3 [811-1124]
Ligand
BDBM264192
Substrate
Meas. Tech.
Enzyme Inhibition Studies
IC50
>30000±n/a nM
Citation
 Astrand, AGrimster, NKawatkar, SKettle, JGNilsson, MKRuston, LSu, QVasbinder, MWinter-Holt, JJWoessner, RDChuaqui, CEMcCabe, J Compounds and methods for inhibiting JAK US Patent  US10167276 Publication Date 1/1/2019 
Target
Name:
Tyrosine-protein kinase JAK3 [811-1124]
Synonyms:
JAK3 JAK3_HUMAN | Tyrosine-protein kinase JAK3 (aa 811-1124)
Type:
Protein
Mol. Mass.:
35601.85
Organism:
Homo sapiens (Human)
Description:
P52333[811-1124]
Residue:
314
  
Inhibitor
Name:
BDBM264192
Synonyms:
(2R)-2-[(3R)-3,4- dimethylpiperazin-1- yl]-N-(3-{2-[(3-ethoxy- 1-methyl-1H- pyrazol-4-yl)amino]-5- fluoropyrimidin-4-yl}- 1H-indol-7-yl)propanamide US10654835, Example 13 US9714236, 13
Type:
Small organic molecule
Emp. Form.:
C27H34FN9O2
Mol. Mass.:
535.6164
SMILES:
CCOc1nn(C)cc1Nc1ncc(F)c(n1)-c1c[nH]c2c(NC(=O)[C@@H](C)N3CCN(C)[C@H](C)C3)cccc12
: