Target
P2X purinoceptor 7
Ligand
BDBM267102
Substrate
Meas. Tech.
Screen Quest Fluo-8 No Wash Calcium Assay
IC50
30.0±n/a nM
Citation
 Pevarello, PLohmer, SLlberati, CSeneci, PPesenti, CPrandi, A Substituted thiazole or oxazole P2X7 receptor antagonists US Patent  US10167281 Publication Date 1/1/2019 
Target
Name:
P2X purinoceptor 7
Synonyms:
ATP receptor P2RX7_HUMAN P2X purinoceptor 7 (P2X7) P2Z receptor | Purinergic receptor
Type:
Protein
Mol. Mass.:
68602.85
Organism:
Homo sapiens (Human)
Description:
Q99572
Residue:
595
  
Inhibitor
Name:
BDBM267102
Synonyms:
2-chloro-N-[2-(4,4-difluoropiperidin-1-yl)-2-(4-methyl-1,3-thiazol-5-yl)ethyl]-5-(pyrazin-2-yl)benzamide US9718812, 72
Type:
Small organic molecule
Emp. Form.:
C22H22ClF2N5OS
Mol. Mass.:
477.958
SMILES:
Cc1ncsc1C(CNC(=O)c1cc(ccc1Cl)-c1cnccn1)N1CCC(F)(F)CC1
: