Target
P2X purinoceptor 7
Ligand
BDBM267109
Substrate
Meas. Tech.
Screen Quest Fluo-8 No Wash Calcium Assay
IC50
28.0±n/a nM
Citation
 Pevarello, PLohmer, SLlberati, CSeneci, PPesenti, CPrandi, A Substituted thiazole or oxazole P2X7 receptor antagonists US Patent  US10167281 Publication Date 1/1/2019 
Target
Name:
P2X purinoceptor 7
Synonyms:
ATP receptor P2RX7_HUMAN P2X purinoceptor 7 (P2X7) P2Z receptor | Purinergic receptor
Type:
Protein
Mol. Mass.:
68602.85
Organism:
Homo sapiens (Human)
Description:
Q99572
Residue:
595
  
Inhibitor
Name:
BDBM267109
Synonyms:
2-chloro-N-[2-(4,4-difluoro-piperidin-1-yl)-2-(1,3-thiazol-5-yl)ethyl]-6-fluoro-benzamide US9718812, 8
Type:
Small organic molecule
Emp. Form.:
C17H17ClF3N3OS
Mol. Mass.:
403.85
SMILES:
Fc1cccc(Cl)c1C(=O)NCC(N1CCC(F)(F)CC1)c1cncs1
: