Target
P2X purinoceptor 7
Ligand
BDBM267125
Substrate
Meas. Tech.
Screen Quest Fluo-8 No Wash Calcium Assay
IC50
32.0±n/a nM
Citation
 Pevarello, PLohmer, SLlberati, CSeneci, PPesenti, CPrandi, A Substituted thiazole or oxazole P2X7 receptor antagonists US Patent  US10167281 Publication Date 1/1/2019 
Target
Name:
P2X purinoceptor 7
Synonyms:
ATP receptor P2RX7_HUMAN P2X purinoceptor 7 (P2X7) P2Z receptor | Purinergic receptor
Type:
Protein
Mol. Mass.:
68602.85
Organism:
Homo sapiens (Human)
Description:
Q99572
Residue:
595
  
Inhibitor
Name:
BDBM267125
Synonyms:
5-amino-2-chloro-N-[2-(4,4-difluoropiperidin-1-yl)-2-(1,3-thiazol-5-yl)ethyl]benzamide US9718812, 16
Type:
Small organic molecule
Emp. Form.:
C17H19ClF2N4OS
Mol. Mass.:
400.874
SMILES:
Nc1ccc(Cl)c(c1)C(=O)NCC(N1CCC(F)(F)CC1)c1cncs1
: