Target
P2X purinoceptor 7
Ligand
BDBM267135
Substrate
Meas. Tech.
Screen Quest Fluo-8 No Wash Calcium Assay
IC50
31.0±n/a nM
Citation
 Pevarello, PLohmer, SLlberati, CSeneci, PPesenti, CPrandi, A Substituted thiazole or oxazole P2X7 receptor antagonists US Patent  US10167281 Publication Date 1/1/2019 
Target
Name:
P2X purinoceptor 7
Synonyms:
ATP receptor P2RX7_HUMAN P2X purinoceptor 7 (P2X7) P2Z receptor | Purinergic receptor
Type:
Protein
Mol. Mass.:
68602.85
Organism:
Homo sapiens (Human)
Description:
Q99572
Residue:
595
  
Inhibitor
Name:
BDBM267135
Synonyms:
N-[2-(4,4-difluoropiperidin-1-yl)-2-(1,3-thiazol-5-yl)ethyl]-2,3-dimethoxybenzamide US9718812, 21
Type:
Small organic molecule
Emp. Form.:
C19H23F2N3O3S
Mol. Mass.:
411.466
SMILES:
COc1cccc(C(=O)NCC(N2CCC(F)(F)CC2)c2cncs2)c1OC
: