Target
P2X purinoceptor 7
Ligand
BDBM267149
Substrate
Meas. Tech.
Screen Quest Fluo-8 No Wash Calcium Assay
IC50
46.0±n/a nM
Citation
 Pevarello, PLohmer, SLlberati, CSeneci, PPesenti, CPrandi, A Substituted thiazole or oxazole P2X7 receptor antagonists US Patent  US10167281 Publication Date 1/1/2019 
Target
Name:
P2X purinoceptor 7
Synonyms:
ATP receptor P2RX7_HUMAN P2X purinoceptor 7 (P2X7) P2Z receptor | Purinergic receptor
Type:
Protein
Mol. Mass.:
68602.85
Organism:
Homo sapiens (Human)
Description:
Q99572
Residue:
595
  
Inhibitor
Name:
BDBM267149
Synonyms:
2,6-dimethyl-N-[2-(4-methyl-1,3-thiazol-5-yl)-2-(1,2,3,4-tetrahydroisoquinolin-2-yl)ethyl]benzamide US9718812, 30
Type:
Small organic molecule
Emp. Form.:
C24H27N3OS
Mol. Mass.:
405.556
SMILES:
Cc1ncsc1C(CNC(=O)c1c(C)cccc1C)N1CCc2ccccc2C1
: