Target
P2X purinoceptor 7
Ligand
BDBM267156
Substrate
Meas. Tech.
Screen Quest Fluo-8 No Wash Calcium Assay
IC50
32.0±n/a nM
Citation
 Pevarello, PLohmer, SLlberati, CSeneci, PPesenti, CPrandi, A Substituted thiazole or oxazole P2X7 receptor antagonists US Patent  US10167281 Publication Date 1/1/2019 
Target
Name:
P2X purinoceptor 7
Synonyms:
ATP receptor P2RX7_HUMAN P2X purinoceptor 7 (P2X7) P2Z receptor | Purinergic receptor
Type:
Protein
Mol. Mass.:
68602.85
Organism:
Homo sapiens (Human)
Description:
Q99572
Residue:
595
  
Inhibitor
Name:
BDBM267156
Synonyms:
N-{2-[2-(2,4-difluorophenyl)morpholin-4-yl]-2-(4-methyl-1,3-thiazol-5-yl)ethyl}quinoline-5-carboxamide US9718812, 99
Type:
Small organic molecule
Emp. Form.:
C26H24F2N4O2S
Mol. Mass.:
494.556
SMILES:
Cc1ncsc1C(CNC(=O)c1cccc2ncccc12)N1CCOC(C1)c1ccc(F)cc1F
: