Target
P2X purinoceptor 7
Ligand
BDBM267219
Substrate
Meas. Tech.
Screen Quest Fluo-8 No Wash Calcium Assay
IC50
32.0±n/a nM
Citation
 Pevarello, PLohmer, SLlberati, CSeneci, PPesenti, CPrandi, A Substituted thiazole or oxazole P2X7 receptor antagonists US Patent  US10167281 Publication Date 1/1/2019 
Target
Name:
P2X purinoceptor 7
Synonyms:
ATP receptor P2RX7_HUMAN P2X purinoceptor 7 (P2X7) P2Z receptor | Purinergic receptor
Type:
Protein
Mol. Mass.:
68602.85
Organism:
Homo sapiens (Human)
Description:
Q99572
Residue:
595
  
Inhibitor
Name:
BDBM267219
Synonyms:
US10167281, Compound 129 | US9718812, 129
Type:
Small organic molecule
Emp. Form.:
C21H19ClF3N5O2S
Mol. Mass.:
497.921
SMILES:
FC(F)c1ncsc1C(CNC(=O)c1cc(ccc1Cl)-c1ncc(F)cn1)N1CCOCC1
: