Target
P2X purinoceptor 7
Ligand
BDBM267223
Substrate
Meas. Tech.
Screen Quest Fluo-8 No Wash Calcium Assay
IC50
22.0±n/a nM
Citation
 Pevarello, PLohmer, SLlberati, CSeneci, PPesenti, CPrandi, A Substituted thiazole or oxazole P2X7 receptor antagonists US Patent  US10167281 Publication Date 1/1/2019 
Target
Name:
P2X purinoceptor 7
Synonyms:
ATP receptor P2RX7_HUMAN P2X purinoceptor 7 (P2X7) P2Z receptor | Purinergic receptor
Type:
Protein
Mol. Mass.:
68602.85
Organism:
Homo sapiens (Human)
Description:
Q99572
Residue:
595
  
Inhibitor
Name:
BDBM267223
Synonyms:
2-chloro-N-{2-[4-(difluoromethyl)-1,3-thiazol-5-yl]-2-(morpholin-4-yl)ethyl}-6-fluorobenzamide US9718812, 130
Type:
Small organic molecule
Emp. Form.:
C17H17ClF3N3O2S
Mol. Mass.:
419.849
SMILES:
FC(F)c1ncsc1C(CNC(=O)c1c(F)cccc1Cl)N1CCOCC1
: