Target
P2X purinoceptor 7
Ligand
BDBM267120
Substrate
Meas. Tech.
YO-PRO-1 Uptake Assay
IC50
16.0±n/a nM
Citation
 Pevarello, PLohmer, SLlberati, CSeneci, PPesenti, CPrandi, A Substituted thiazole or oxazole P2X7 receptor antagonists US Patent  US10167281 Publication Date 1/1/2019 
Target
Name:
P2X purinoceptor 7
Synonyms:
ATP receptor P2RX7_HUMAN P2X purinoceptor 7 (P2X7) P2Z receptor | Purinergic receptor
Type:
Protein
Mol. Mass.:
68602.85
Organism:
Homo sapiens (Human)
Description:
Q99572
Residue:
595
  
Inhibitor
Name:
BDBM267120
Synonyms:
2-chloro-N-[2-(4,4-difluoropiperidin-1-yl)-2-[2-(trifluoromethyl)-1,3-thiazol-5-yl]ethyl]-6-fluorobenzamide US9718812, 81
Type:
Small organic molecule
Emp. Form.:
C18H16ClF6N3OS
Mol. Mass.:
471.848
SMILES:
Fc1cccc(Cl)c1C(=O)NCC(N1CCC(F)(F)CC1)c1cnc(s1)C(F)(F)F
: