Target
P2X purinoceptor 7
Ligand
BDBM267143
Substrate
Meas. Tech.
YO-PRO-1 Uptake Assay
IC50
44.0±n/a nM
Citation
 Pevarello, PLohmer, SLlberati, CSeneci, PPesenti, CPrandi, A Substituted thiazole or oxazole P2X7 receptor antagonists US Patent  US10167281 Publication Date 1/1/2019 
Target
Name:
P2X purinoceptor 7
Synonyms:
ATP receptor P2RX7_HUMAN P2X purinoceptor 7 (P2X7) P2Z receptor | Purinergic receptor
Type:
Protein
Mol. Mass.:
68602.85
Organism:
Homo sapiens (Human)
Description:
Q99572
Residue:
595
  
Inhibitor
Name:
BDBM267143
Synonyms:
2,6-dimethyl-N-[2-(4-phenoxypiperidin-1-yl)-2-(1,3-thiazol-5-yl)ethyl]benzamide US9718812, 26
Type:
Small organic molecule
Emp. Form.:
C25H29N3O2S
Mol. Mass.:
435.582
SMILES:
Cc1cccc(C)c1C(=O)NCC(N1CCC(CC1)Oc1ccccc1)c1cncs1
: