Target
P2X purinoceptor 7
Ligand
BDBM267134
Substrate
Meas. Tech.
YO-PRO-1 Uptake Assay
IC50
28.0±n/a nM
Citation
 Pevarello, PLohmer, SLlberati, CSeneci, PPesenti, CPrandi, A Substituted thiazole or oxazole P2X7 receptor antagonists US Patent  US10167281 Publication Date 1/1/2019 
Target
Name:
P2X purinoceptor 7
Synonyms:
ATP receptor P2RX7_HUMAN P2X purinoceptor 7 (P2X7) P2Z receptor | Purinergic receptor
Type:
Protein
Mol. Mass.:
68602.85
Organism:
Homo sapiens (Human)
Description:
Q99572
Residue:
595
  
Inhibitor
Name:
BDBM267134
Synonyms:
2-chloro-N-[2-(2-cyclopropyl-1,3-thiazol-5-yl)-2-(4,4-difluoropiperidin-1-yl)ethyl]-6-fluorobenzamide US9718812, 88
Type:
Small organic molecule
Emp. Form.:
C20H21ClF3N3OS
Mol. Mass.:
443.913
SMILES:
Fc1cccc(Cl)c1C(=O)NCC(N1CCC(F)(F)CC1)c1cnc(s1)C1CC1
: