Target
Bromodomain-containing protein 2 [364-436]
Ligand
BDBM313774
Substrate
Meas. Tech.
Binding Assay
IC50
<100±n/a nM
Citation
 Burns, CGarnier, JSharp, PPFeutrill, JCuzzupe, A Benzodiazepines as bromodomain inhibitors US Patent  US10167292 Publication Date 1/1/2019 
Target
Name:
Bromodomain-containing protein 2 [364-436]
Synonyms:
BRD2 Bromodomain-containing protein 2 (BRD2)(BD2) KIAA9001 | RING3
Type:
Protein
Mol. Mass.:
8615.14
Organism:
Homo sapiens (Human)
Description:
BD2 (364-436 aa) of P25440
Residue:
73
  
Inhibitor
Name:
BDBM313774
Synonyms:
US10167292, Example 8
Type:
Small organic molecule
Emp. Form.:
C22H19ClN6
Mol. Mass.:
402.879
SMILES:
Cc1nnn2CCN(c3ccc(Cl)cc3)c3cc(ccc3-c12)-c1ccc(N)nc1
: