Target
Bromodomain-containing protein 2 [91-163]
Ligand
BDBM313775
Substrate
Meas. Tech.
Binding Assay
IC50
<100±n/a nM
Citation
 Burns, CGarnier, JSharp, PPFeutrill, JCuzzupe, A Benzodiazepines as bromodomain inhibitors US Patent  US10167292 Publication Date 1/1/2019 
Target
Name:
Bromodomain-containing protein 2 [91-163]
Synonyms:
BRD2 Bromodomain-containing protein 2 (BRD2)(BD1) KIAA9001 | RING3
Type:
Mol. Mass.:
8836.08
Organism:
Homo sapiens (Human)
Description:
BD1 (91-163 aa) of P25440
Residue:
73
  
Inhibitor
Name:
BDBM313775
Synonyms:
US10167292, Example 10
Type:
Small organic molecule
Emp. Form.:
C20H17ClN6
Mol. Mass.:
376.842
SMILES:
Cc1nnn2CCN(c3ccc(Cl)cc3)c3cc(ccc3-c12)-c1cc[nH]n1
: