Target
Bromodomain-containing protein 4 [368-440]
Ligand
BDBM313777
Substrate
Meas. Tech.
Binding Assay
IC50
<100±n/a nM
Citation
 Burns, CGarnier, JSharp, PPFeutrill, JCuzzupe, A Benzodiazepines as bromodomain inhibitors US Patent  US10167292 Publication Date 1/1/2019 
Target
Name:
Bromodomain-containing protein 4 [368-440]
Synonyms:
BRD4 Bromo domain 2 Bromodomain-containing protein 4 (BRD4) Bromo 2 Bromodomain-containing protein 4 (BRD4)(Bromo 2) Bromodomain-containing protein 4 Bromodomain 2 (BRD4-2) HUNK1
Type:
Protein
Mol. Mass.:
8564.63
Organism:
Homo sapiens (Human)
Description:
BD2 (368-440 aa) of O60885
Residue:
73
  
Inhibitor
Name:
BDBM313777
Synonyms:
US10167292, Example 12
Type:
Small organic molecule
Emp. Form.:
C21H18ClN7
Mol. Mass.:
403.868
SMILES:
Cc1nnn2CCN(c3ccc(Cl)cc3)c3cc(ccc3-c12)-c1cnc(N)nc1
: