Target
Bromodomain-containing protein 2 [91-163]
Ligand
BDBM313779
Substrate
Meas. Tech.
Binding Assay
IC50
<100±n/a nM
Citation
 Burns, CGarnier, JSharp, PPFeutrill, JCuzzupe, A Benzodiazepines as bromodomain inhibitors US Patent  US10167292 Publication Date 1/1/2019 
Target
Name:
Bromodomain-containing protein 2 [91-163]
Synonyms:
BRD2 Bromodomain-containing protein 2 (BRD2)(BD1) KIAA9001 | RING3
Type:
Mol. Mass.:
8836.08
Organism:
Homo sapiens (Human)
Description:
BD1 (91-163 aa) of P25440
Residue:
73
  
Inhibitor
Name:
BDBM313779
Synonyms:
US10167292, Example 16
Type:
Small organic molecule
Emp. Form.:
C18H17ClN4
Mol. Mass.:
324.807
SMILES:
C[C@@H]1CN(c2ccc(Cl)cc2)c2ccccc2-c2c(C)nnn12
: