Target
Bromodomain-containing protein 4 [368-440]
Ligand
BDBM313779
Substrate
Meas. Tech.
Binding Assay
IC50
<100±n/a nM
Citation
 Burns, CGarnier, JSharp, PPFeutrill, JCuzzupe, A Benzodiazepines as bromodomain inhibitors US Patent  US10167292 Publication Date 1/1/2019 
Target
Name:
Bromodomain-containing protein 4 [368-440]
Synonyms:
BRD4 Bromo domain 2 Bromodomain-containing protein 4 (BRD4) Bromo 2 Bromodomain-containing protein 4 (BRD4)(Bromo 2) Bromodomain-containing protein 4 Bromodomain 2 (BRD4-2) HUNK1
Type:
Protein
Mol. Mass.:
8564.63
Organism:
Homo sapiens (Human)
Description:
BD2 (368-440 aa) of O60885
Residue:
73
  
Inhibitor
Name:
BDBM313779
Synonyms:
US10167292, Example 16
Type:
Small organic molecule
Emp. Form.:
C18H17ClN4
Mol. Mass.:
324.807
SMILES:
C[C@@H]1CN(c2ccc(Cl)cc2)c2ccccc2-c2c(C)nnn12
: