Target
Acetylcholinesterase
Ligand
BDBM10436
Substrate
BDBM8959
Meas. Tech.
Enzyme Inhibition Assay
IC50
5270±n/a nM
Citation
 Mary, ARenko, DZGuillou, CThal, C Potent acetylcholinesterase inhibitors: design, synthesis, and structure-activity relationships of bis-interacting ligands in the galanthamine series. Bioorg Med Chem 6:1835-50 (1998)  
Target
Name:
Acetylcholinesterase
Synonyms:
3.1.1.7 Acetylcholinesterase (AChE) ache
Type:
Mol. Mass.:
65900.74
Organism:
Tetronarce californica (Pacific electric ray) (Torpedo californica)
Description:
P04058
Residue:
586
  
Inhibitor
Name:
BDBM10436
Synonyms:
10-(Phthalimidodecyl)-trimethylammonium bromide galanthamine deriv. 13e
Type:
Small organic molecule
Emp. Form.:
C21H33N2O2
Mol. Mass.:
345.4984
SMILES:
C[N+](C)(C)CCCCCCCCCCN1C(=O)c2ccccc2C1=O
:
Substrate
Name:
BDBM8959
Synonyms:
(2-Mercaptoethyl)trimethylammonium iodide acetate Acetylthiocholine acetylthiocholine chloride | acetylthiocholine iodide
Type:
Small organic molecule
Emp. Form.:
C7H16NOS
Mol. Mass.:
162.272
SMILES:
CC(=O)SCC[N+](C)(C)C
: